Reaction Details
TargetD(3) dopamine receptor
LigandBDBM50099803
Substrate/Competitorn/a
Meas. Tech.ChEMBL_62749 (CHEMBL674590)
Ki 2.9±n/a nM
Citation Huang, YLuedtke, RRFreeman, RAWu, LMach, RH Synthesis and structure-activity relationships of naphthamides as dopamine D3 receptor ligands. J Med Chem44:1815-26 (2001) D(3) dopamine receptor
Name:D(3) dopamine receptor
Type:Protein
Mol. Mass.:49540.58
Organism:Rattus norvegicus (Rat)
Description:P19020
Residue:446
BDBM50099803
NameBDBM50099803
Synonyms:4-Bromo-1-methoxy-naphthalene-2-carboxylic acid (1-cycloheptyl-pyrrolidin-3-yl)-amide | CHEMBL53320
TypeSmall organic molecule
Emp. Form.C23H29BrN2O2
Mol. Mass.445.393
SMILESCOc1c(cc(Br)c2ccccc12)C(=O)N[C@@H]1CCN(C1)C1CCCCCC1