Reaction Details
TargetGag-Pol polyprotein [489-587]
LigandBDBM50099842
Substrate/Competitorn/a
Meas. Tech.ChEBML_157720
Ki 0.001±n/a nM
Citation Sham, HLBetebenner, DAHerrin, TKumar, GSaldivar, AVasavanonda, SMolla, AKempf, DJPlattner, JJNorbeck, DW Synthesis and antiviral activities of the major metabolites of the HIV protease inhibitor ABT-378 (Lopinavir). Bioorg Med Chem Lett11:1351-3 (2001) Gag-Pol polyprotein [489-587]
Name:Gag-Pol polyprotein [489-587]
Type:Enzyme Subunit
Mol. Mass.:10781.16
Organism:Human immunodeficiency virus type 1
Description:P04585[489-587]
Residue:99
BDBM50099842
NameBDBM50099842
Synonyms:(S)-N-[(S)-4-[2-(2,6-Dimethyl-phenoxy)-acetylamino]-3-(S)-hydroxy-5-phenyl-1-((S)-phenylmethyl)-pentyl]-2-(2,4-dioxo-tetrahydro-pyrimidin-1-yl)-3-methyl-butyramide N-[(3S,5S)-4-[2-(2,6-Dimethyl-phenoxy)-acetylamino]-3-hydroxy-5-phenyl-1-((S)-phenylmethyl)-pentyl]-2-(2,4-dioxo-tetrahydro-pyrimidin-1-yl)-3-(S)-methyl-butyramide
TypeSmall organic molecule
Emp. Form.C37H46N4O6
Mol. Mass.642.7843
SMILESCC(C)[C@H](N1CCC(=O)NC1=O)C(=O)N[C@H](C[C@H](O)[C@H](Cc1ccccc1)NC(=O)COc1c(C)cccc1C)Cc1ccccc1