Reaction Details
TargetGag-Pol polyprotein [489-587]
LigandBDBM578
Substrate/Competitorn/a
Meas. Tech.ChEBML_157720
Ki 0.001±n/a nM
Citation Sham, HLBetebenner, DAHerrin, TKumar, GSaldivar, AVasavanonda, SMolla, AKempf, DJPlattner, JJNorbeck, DW Synthesis and antiviral activities of the major metabolites of the HIV protease inhibitor ABT-378 (Lopinavir). Bioorg Med Chem Lett11:1351-3 (2001) Gag-Pol polyprotein [489-587]
Name:Gag-Pol polyprotein [489-587]
Type:Enzyme Subunit
Mol. Mass.:10781.16
Organism:Human immunodeficiency virus type 1
Description:P04585[489-587]
Residue:99
BDBM578
NameBDBM578
Synonyms:(2S)-N-[(2S,4S,5S)-5-[2-(2,6-dimethylphenoxy)acetamido]-4-hydroxy-1,6-diphenylhexan-2-yl]-3-methyl-2-(2-oxo-1,3-diazinan-1-yl)butanamide Aluviran LPV | Lopinavir
TypeSmall organic molecule
Emp. Form.C37H48N4O5
Mol. Mass.628.8008
SMILESCC(C)[C@H](N1CCCNC1=O)C(=O)N[C@H](C[C@H](O)[C@H](Cc1ccccc1)NC(=O)COc1c(C)cccc1C)Cc1ccccc1