Reaction Details
Target5-hydroxytryptamine receptor 2A
LigandBDBM50099893
Substrate/Competitorn/a
Meas. Tech.ChEBML_2294
Ki 232±n/a nM
Citation Huang, YKegeles, LSBae, SHwang, DRoth, BLSavage, JELaruelle, M Synthesis of potent and selective dopamine D(4) antagonists as candidate radioligands. Bioorg Med Chem Lett11:1375-7 (2001) 5-hydroxytryptamine receptor 2A
Name:5-hydroxytryptamine receptor 2A
Type:undefined
Mol. Mass.:52607.65
Organism:Homo sapiens (Human)
Description:P28223
Residue:471
BDBM50099893
NameBDBM50099893
Synonyms:3-[4-(4-Fluoro-phenyl)-piperazin-1-ylmethyl]-1H-pyrrolo[2,3-b]pyridine | CHEMBL28997
TypeSmall organic molecule
Emp. Form.C18H19FN4
Mol. Mass.310.3687
SMILESFc1ccc(cc1)N1CCN(Cc2c[nH]c3ncccc23)CC1