Reaction Details
TargetD(4) dopamine receptor
LigandBDBM50099888
Substrate/Competitorn/a
Meas. Tech.ChEBML_60982
Ki 5±n/a nM
Citation Huang, YKegeles, LSBae, SHwang, DRoth, BLSavage, JELaruelle, M Synthesis of potent and selective dopamine D(4) antagonists as candidate radioligands. Bioorg Med Chem Lett11:1375-7 (2001) D(4) dopamine receptor
Name:D(4) dopamine receptor
Type:Enzyme Catalytic Domain
Mol. Mass.:41307.65
Organism:RAT
Description:DOPAMINE D4.4 0 RAT::P30729
Residue:387
BDBM50099888
NameBDBM50099888
Synonyms:3-[4-(4-Ethyl-phenyl)-piperazin-1-ylmethyl]-1H-pyrrolo[2,3-b]pyridine | CHEMBL282829
TypeSmall organic molecule
Emp. Form.C20H24N4
Mol. Mass.320.4314
SMILESCCc1ccc(cc1)N1CCN(Cc2c[nH]c3ncccc23)CC1