Reaction Details
TargetD(4) dopamine receptor
LigandBDBM50099895
Substrate/Competitorn/a
Meas. Tech.ChEBML_60982
Ki 148±n/a nM
Citation Huang, YKegeles, LSBae, SHwang, DRoth, BLSavage, JELaruelle, M Synthesis of potent and selective dopamine D(4) antagonists as candidate radioligands. Bioorg Med Chem Lett11:1375-7 (2001) D(4) dopamine receptor
Name:D(4) dopamine receptor
Type:Enzyme Catalytic Domain
Mol. Mass.:41307.65
Organism:RAT
Description:DOPAMINE D4.4 0 RAT::P30729
Residue:387
BDBM50099895
NameBDBM50099895
Synonyms:3-(4-Biphenyl-4-yl-piperazin-1-ylmethyl)-1H-pyrrolo[2,3-b]pyridine | CHEMBL287671
TypeSmall organic molecule
Emp. Form.C24H24N4
Mol. Mass.368.4742
SMILESC(N1CCN(CC1)c1ccc(cc1)-c1ccccc1)c1c[nH]c2ncccc12