Reaction Details
TargetUrokinase-type plasminogen activator
LigandBDBM50099925
Substrate/Competitorn/a
Meas. Tech.ChEBML_213135
Ki 641±n/a nM
Citation Subasinghe, NLIllig, CHoffman, JRudolph, MJWilson, KJSoll, RRandle, TGreen, DLewandowski, FZhang, MBone, RSpurlino, JDesJarlais, RDeckman, IMolloy, CJManthey, CZhou, ZSharp, CMaguire, DCrysler, CGrasberger, B Structure-based design, synthesis and SAR of a novel series of thiopheneamidine urokinase plasminogen activator inhibitors. Bioorg Med Chem Lett11:1379-82 (2001) Urokinase-type plasminogen activator
Name:Urokinase-type plasminogen activator
Type:Enzyme
Mol. Mass.:48528.62
Organism:Homo sapiens (Human)
Description:P00749
Residue:431
BDBM50099925
NameBDBM50099925
Synonyms:4-(4-Cyclohexyl-thiazol-2-yl)-5-methylsulfanyl-thiophene-2-carboxamidine | CHEMBL283859
TypeSmall organic molecule
Emp. Form.C15H19N3S3
Mol. Mass.337.526
SMILESCSc1sc(cc1-c1nc(cs1)C1CCCCC1)C(N)=N