Reaction Details
TargetReceptor tyrosine-protein kinase erbB-2
LigandBDBM50099962
Substrate/Competitorn/a
Meas. Tech.ChEMBL_194950 (CHEMBL795906)
IC50 4400±n/a nM
Citation Cockerill, SStubberfield, CStables, JCarter, MGuntrip, SSmith, KMcKeown, SShaw, RTopley, PThomsen, LAffleck, KJowett, AHayes, DWillson, MWoollard, PSpalding, D Indazolylamino quinazolines and pyridopyrimidines as inhibitors of the EGFr and C-erbB-2. Bioorg Med Chem Lett11:1401-5 (2001) Receptor tyrosine-protein kinase erbB-2
Name:Receptor tyrosine-protein kinase erbB-2
Type:PROTEIN
Mol. Mass.:138816.81
Organism:Rattus norvegicus
Description:ChEMBL_42235
Residue:1257
BDBM50099962
NameBDBM50099962
Synonyms:(3-Benzyl-3H-benzoimidazol-5-yl)-quinazolin-4-yl-amine | CHEMBL281881
TypeSmall organic molecule
Emp. Form.C22H17N5
Mol. Mass.351.4039
SMILESC(c1ccccc1)n1cnc2ccc(Nc3ncnc4ccccc34)cc12