Reaction Details
TargetReceptor tyrosine-protein kinase erbB-2
LigandBDBM50099971
Substrate/Competitorn/a
Meas. Tech.ChEMBL_194950 (CHEMBL795906)
IC50 26±n/a nM
Citation Cockerill, SStubberfield, CStables, JCarter, MGuntrip, SSmith, KMcKeown, SShaw, RTopley, PThomsen, LAffleck, KJowett, AHayes, DWillson, MWoollard, PSpalding, D Indazolylamino quinazolines and pyridopyrimidines as inhibitors of the EGFr and C-erbB-2. Bioorg Med Chem Lett11:1401-5 (2001) Receptor tyrosine-protein kinase erbB-2
Name:Receptor tyrosine-protein kinase erbB-2
Type:PROTEIN
Mol. Mass.:138816.81
Organism:Rattus norvegicus
Description:ChEMBL_42235
Residue:1257
BDBM50099971
NameBDBM50099971
Synonyms:CHEMBL288557 | N*4*-(1-Benzyl-1H-indol-5-yl)-pyrido[3,4-d]pyrimidine-4,6-diamine
TypeSmall organic molecule
Emp. Form.C22H18N6
Mol. Mass.366.4185
SMILESNc1cc2c(Nc3ccc4n(Cc5ccccc5)ccc4c3)ncnc2cn1