Reaction Details
TargetDual specificity mitogen-activated protein kinase kinase 1
LigandBDBM50095226
Substrate/Competitorn/a
Meas. Tech.ChEBML_60728
IC50 34±n/a nM
Citation Zhang, NWu, BEudy, NWang, YYe, FPowell, DWissner, AFeldberg, LRKim, SCMallon, RKovacs, EDToral-Barza, LKohler, CA MEK (MAPKK) inhibitors. Part 2: structure-activity relationships of 4-anilino-3-cyano-6,7-dialkoxyquinolines. Bioorg Med Chem Lett11:1407-10 (2001) Dual specificity mitogen-activated protein kinase kinase 1
Name:Dual specificity mitogen-activated protein kinase kinase 1
Type:Other Protein Type
Mol. Mass.:43439.03
Organism:Homo sapiens (Human)
Description:Full-length human MEK-1 was generated by PCR and purified as a fusion protein from Escherichia coli lysates.
Residue:393
BDBM50095226
NameBDBM50095226
Synonyms:6,7-Dimethoxy-4-(4-phenoxy-phenylamino)-quinoline-3-carbonitrile | CHEMBL31733
TypeSmall organic molecule
Emp. Form.C24H19N3O3
Mol. Mass.397.426
SMILESCOc1cc2ncc(C#N)c(Nc3ccc(Oc4ccccc4)cc3)c2cc1OC