Reaction Details
TargetDual specificity mitogen-activated protein kinase kinase 1
LigandBDBM50099983
Substrate/Competitorn/a
Meas. Tech.ChEMBL_60851 (CHEMBL675993)
IC50 23±n/a nM
Citation Zhang, NWu, BEudy, NWang, YYe, FPowell, DWissner, AFeldberg, LRKim, SCMallon, RKovacs, EDToral-Barza, LKohler, CA MEK (MAPKK) inhibitors. Part 2: structure-activity relationships of 4-anilino-3-cyano-6,7-dialkoxyquinolines. Bioorg Med Chem Lett11:1407-10 (2001) Dual specificity mitogen-activated protein kinase kinase 1
Name:Dual specificity mitogen-activated protein kinase kinase 1
Type:Other Protein Type
Mol. Mass.:43439.03
Organism:Homo sapiens (Human)
Description:Full-length human MEK-1 was generated by PCR and purified as a fusion protein from Escherichia coli lysates.
Residue:393
BDBM50099983
NameBDBM50099983
Synonyms:6-Methoxy-7-(3-morpholin-4-yl-propoxy)-4-(4-thiophen-3-ylmethyl-phenylamino)-quinoline-3-carbonitrile | CHEMBL30359
TypeSmall organic molecule
Emp. Form.C29H30N4O3S
Mol. Mass.514.639
SMILESCOc1cc2c(Nc3ccc(Cc4ccsc4)cc3)c(cnc2cc1OCCCN1CCOCC1)C#N