Reaction Details
TargetCarboxypeptidase A1
LigandBDBM50100009
Substrate/Competitorn/a
Meas. Tech.ChEBML_45619
Ki 260±n/a nM
Citation Han, MSKim, DH Effect of zinc ion on the inhibition of carboxypeptidase A by imidazole-bearing substrate analogues. Bioorg Med Chem Lett11:1425-7 (2001) Carboxypeptidase A1
Name:Carboxypeptidase A1
Type:Enzyme
Mol. Mass.:47073.90
Organism:Bos taurus (bovine)
Description:From Sigma-Aldrich Co.
Residue:419
BDBM50100009
NameBDBM50100009
Synonyms:2-(1H-Imidazol-4-yl)-3-phenyl-propionic acid CHEMBL33352
TypeSmall organic molecule
Emp. Form.C12H12N2O2
Mol. Mass.216.2359
SMILESOC(=O)C(Cc1ccccc1)c1cnc[nH]1