Reaction Details
TargetC-C chemokine receptor type 3
LigandBDBM50100052
Substrate/Competitorn/a
Meas. Tech.ChEBML_41921
IC50 3±n/a nM
Citation Dhanak, DChristmann, LTDarcy, MGKeenan, RMKnight, SDLee, JRidgers, LHSarau, HMShah, DHWhite, JRZhang, L Discovery of potent and selective phenylalanine derived CCR3 receptor antagonists. Part 2. Bioorg Med Chem Lett11:1445-50 (2001) C-C chemokine receptor type 3
Name:C-C chemokine receptor type 3
Type:Enzyme
Mol. Mass.:41053.88
Organism:Homo sapiens (Human)
Description:P51677
Residue:355
BDBM50100052
NameBDBM50100052
Synonyms:(R)-2-[(S)-2-[(Naphthalene-1-carbonyl)-amino]-3-(4-nitro-phenyl)-propionylamino]-propionic acid ethyl ester | CHEMBL32334
TypeSmall organic molecule
Emp. Form.C25H25N3O6
Mol. Mass.463.4825
SMILESCCOC(=O)[C@@H](C)NC(=O)[C@H](Cc1ccc(cc1)[N+]([O-])=O)NC(=O)c1cccc2ccccc12