Reaction Details
TargetAmyloid-beta precursor protein
LigandBDBM50100133
Substrate/Competitorn/a
Meas. Tech.ChEMBL_35679 (CHEMBL649528)
Ki 1.90±n/a nM
Citation Zhuang, ZPKung, MPHou, CSkovronsky, DMGur, TLPlössl, KTrojanowski, JQLee, VMKung, HF Radioiodinated styrylbenzenes and thioflavins as probes for amyloid aggregates. J Med Chem44:1905-14 (2001) Amyloid-beta precursor protein
Name:Amyloid-beta precursor protein
Type:Single-pass type I membrane protein
Mol. Mass.:86890.41
Organism:Homo sapiens (Human)
Description:P05067
Residue:770
BDBM50100133
NameBDBM50100133
Synonyms:CHEMBL55401 | [4-(6-Bromo-benzothiazol-2-yl)-phenyl]-dimethyl-amine
TypeSmall organic molecule
Emp. Form.C15H13BrN2S
Mol. Mass.333.246
SMILESCN(C)c1ccc(cc1)-c1nc2ccc(Br)cc2s1