Reaction Details
TargetAmyloid-beta precursor protein
LigandBDBM50100130
Substrate/Competitorn/a
Meas. Tech.ChEMBL_35679 (CHEMBL649528)
Ki 0.900±n/a nM
Citation Zhuang, ZPKung, MPHou, CSkovronsky, DMGur, TLPlössl, KTrojanowski, JQLee, VMKung, HF Radioiodinated styrylbenzenes and thioflavins as probes for amyloid aggregates. J Med Chem44:1905-14 (2001) Amyloid-beta precursor protein
Name:Amyloid-beta precursor protein
Type:Single-pass type I membrane protein
Mol. Mass.:86890.41
Organism:Homo sapiens (Human)
Description:P05067
Residue:770
BDBM50100130
NameBDBM50100130
Synonyms:4-(6-Iodobenzo[d]thiazol-2-yl)-N,N-dimethylaniline [4-(6-Iodo-benzothiazol-2-yl)-phenyl]-dimethyl-amine
TypeSmall organic molecule
Emp. Form.C15H13IN2S
Mol. Mass.380.247
SMILESCN(C)c1ccc(cc1)-c1nc2ccc(I)cc2s1