Reaction Details
TargetAmyloid-beta precursor protein
LigandBDBM50100135
Substrate/Competitorn/a
Meas. Tech.ChEMBL_35679 (CHEMBL649528)
Ki>1000±n/a nM
Citation Zhuang, ZPKung, MPHou, CSkovronsky, DMGur, TLPlössl, KTrojanowski, JQLee, VMKung, HF Radioiodinated styrylbenzenes and thioflavins as probes for amyloid aggregates. J Med Chem44:1905-14 (2001) Amyloid-beta precursor protein
Name:Amyloid-beta precursor protein
Type:Single-pass type I membrane protein
Mol. Mass.:86890.41
Organism:Homo sapiens (Human)
Description:P05067
Residue:770
BDBM50100135
NameBDBM50100135
Synonyms:(E,E)-1-iodo-2,5-bis-(3-hydroxycarbonyl-4-methoxy)styrylbenzene CHEMBL292910
TypeSmall organic molecule
Emp. Form.C26H21IO6
Mol. Mass.556.3458
SMILESCOc1ccc(\C=C\c2ccc(\C=C\c3ccc(OC)c(c3)C(O)=O)c(I)c2)cc1C(O)=O