Reaction Details
TargetAlpha-1A adrenergic receptor
LigandBDBM50100215
Substrate/Competitorn/a
Meas. Tech.ChEMBL_34023 (CHEMBL646012)
Ki 0.48±n/a nM
Citation Meyer, MDAltenbach, RJBai, HBasha, FZCarroll, WAKerwin, JFLebold, SALee, EPratt, JKSippy, KBTietje, KWendt, MDBrune, MEBuckner, SAHancock, AADrizin, I Structure-activity studies for a novel series of bicyclic substituted hexahydrobenz[e]isoindole alpha1A adrenoceptor antagonists as potential agents for the symptomatic treatment of benign prostatic hyperplasia. J Med Chem44:1971-85 (2001) Alpha-1A adrenergic receptor
Name:Alpha-1A adrenergic receptor
Type:Protein
Mol. Mass.:51620.15
Organism:Rattus norvegicus (Rat)
Description:P43140
Residue:466
BDBM50100215
NameBDBM50100215
Synonyms:3-[2-(6-Methoxy-1,3,3a,4,5,9b-hexahydro-benzo[e]isoindol-2-yl)-ethyl]-1H-thieno[3,4-d]pyrimidine-2,4-dione | CHEMBL445071
TypeSmall organic molecule
Emp. Form.C21H23N3O3S
Mol. Mass.397.491
SMILESCOc1cccc2[C@@H]3CN(CCn4c(=O)[nH]c5cscc5c4=O)C[C@@H]3CCc12