Reaction Details
TargetAlpha-1A adrenergic receptor
LigandBDBM50100238
Substrate/Competitorn/a
Meas. Tech.ChEMBL_34023 (CHEMBL646012)
Ki 0.09±n/a nM
Citation Meyer, MDAltenbach, RJBai, HBasha, FZCarroll, WAKerwin, JFLebold, SALee, EPratt, JKSippy, KBTietje, KWendt, MDBrune, MEBuckner, SAHancock, AADrizin, I Structure-activity studies for a novel series of bicyclic substituted hexahydrobenz[e]isoindole alpha1A adrenoceptor antagonists as potential agents for the symptomatic treatment of benign prostatic hyperplasia. J Med Chem44:1971-85 (2001) Alpha-1A adrenergic receptor
Name:Alpha-1A adrenergic receptor
Type:Protein
Mol. Mass.:51620.15
Organism:Rattus norvegicus (Rat)
Description:P43140
Residue:466
BDBM50100238
NameBDBM50100238
Synonyms:7-Methoxy-3-[2-(6-methoxy-1,3,3a,4,5,9b-hexahydro-benzo[e]isoindol-2-yl)-ethyl]-1H-quinazoline-2,4-dione | CHEMBL58956
TypeSmall organic molecule
Emp. Form.C24H27N3O4
Mol. Mass.421.4889
SMILESCOc1ccc2c(c1)[nH]c(=O)n(CCN1C[C@@H]3CCc4c(OC)cccc4[C@@H]3C1)c2=O