Reaction Details
TargetIntegrin alpha-V/beta-3
LigandBDBM50100346
Substrate/Competitorn/a
Meas. Tech.ChEMBL_217951 (CHEMBL872803)
IC50>100000±n/a nM
Citation Smyth, MSRose, JMehrotra, MMHeath, JRuhter, GSchotten, TSeroogy, JVolkots, DPandey, AScarborough, RM Spirocyclic nonpeptide glycoprotein IIb-IIIa antagonists. Part 1: design of potent and specific 3,9-diazaspiro[5.5]undecanes. Bioorg Med Chem Lett11:1289-92 (2001) Integrin alpha-V/beta-3
Name:Integrin alpha-V/beta-3
Type:Enzyme
Mol. Mass.:n/a
Description:n/a
Components:This complex has 2 components.
Component 1
Name:Integrin alpha-V
Synonyms:ITAV_HUMAN Integrin alpha-V/alpha-5 VNRA Vitronectin receptor | Vitronectin receptor subunit alpha
Type:PROTEIN
Mol. Mass.:116024.92
Organism:Homo sapiens (Human)
Description:ChEMBL_582336
Residue:1048
Component 2
Name:Integrin beta-3
Synonyms:CD_antigen=CD61 GPIIIa ITGB3 Platelet membrane glycoprotein IIIa
Type:Protein
Mol. Mass.:87038.91
Organism:Homo sapiens (Human)
Description:P05106
Residue:788
BDBM50100346
NameBDBM50100346
Synonyms:(S)-2-(3,5-Dimethyl-isoxazole-4-sulfonylamino)-3-[(9-pyridin-4-yl-3,9-diaza-spiro[5.5]undecane-3-carbonyl)-amino]-propionic acid | CHEMBL23814
TypeSmall organic molecule
Emp. Form.C23H32N6O6S
Mol. Mass.520.602
SMILESCc1noc(C)c1S(=O)(=O)N[C@@H](CNC(=O)N1CCC2(CC1)CCN(CC2)c1ccncc1)C(O)=O