Reaction Details
TargetIntegrin alpha-IIb/beta-3
LigandBDBM50092105
Substrate/Competitorn/a
Meas. Tech.ChEMBL_70184 (CHEMBL685321)
IC50 2±n/a nM
Citation Smyth, MSRose, JMehrotra, MMHeath, JRuhter, GSchotten, TSeroogy, JVolkots, DPandey, AScarborough, RM Spirocyclic nonpeptide glycoprotein IIb-IIIa antagonists. Part 1: design of potent and specific 3,9-diazaspiro[5.5]undecanes. Bioorg Med Chem Lett11:1289-92 (2001) Integrin alpha-IIb/beta-3
Name:Integrin alpha-IIb/beta-3
Synonyms:Glycoprotein IIb/IIIa
Type:n/a
Mol. Mass.:n/a
Description:ASSAY_ID of EBI is 30109
Components:This complex has 2 components.
Component 1
Name:Integrin beta-3
Type:Protein
Mol. Mass.:87038.91
Organism:Homo sapiens (Human)
Description:P05106
Residue:788
Component 2
Name:Integrin alpha-IIb
Synonyms:CD_antigen=CD41 GPIIb Glycoprotein IIb ITGA2B Integrin alpha-IIb heavy chain Integrin alpha-IIb light chain, form 2 Integrin alpha-V/beta-3 and alpha-IIb/beta 3 | Platelet membrane glycoprotein IIb
Type:Protein
Mol. Mass.:113354.85
Organism:Homo sapiens (Human)
Description:P08514
Residue:1039
BDBM50092105
NameBDBM50092105
Synonyms:(S)-2-(3,5-Dimethyl-isoxazole-4-sulfonylamino)-5-oxo-5-(9-pyridin-4-yl-3,9-diaza-spiro[5.5]undec-3-yl)-pentanoic acid CHEMBL25770
TypeSmall organic molecule
Emp. Form.C24H33N5O6S
Mol. Mass.519.614
SMILESCc1noc(C)c1S(=O)(=O)N[C@@H](CCC(=O)N1CCC2(CC1)CCN(CC2)c1ccncc1)C(O)=O