Reaction Details
TargetPeroxisome proliferator-activated receptor gamma
LigandBDBM28681
Substrate/Competitorn/a
Meas. Tech.ChEMBL_220901 (CHEMBL824656)
EC50 657±n/a nM
Citation Brooks, DAEtgen, GJRito, CJShuker, AJDominianni, SJWarshawsky, AMArdecky, RPaterniti, JRTyhonas, JKaranewsky, DSKauffman, RFBroderick, CLOldham, BAMontrose-Rafizadeh, CWinneroski, LLFaul, MMMcCarthy, JR Design and synthesis of 2-methyl-2-[4-(2-[5-methyl-2-aryloxazol-4-yl]ethoxy)phenoxy]propionic acids: a new class of dual PPARalpha/gamma agonists. J Med Chem44:2061-4 (2001) Peroxisome proliferator-activated receptor gamma
Name:Peroxisome proliferator-activated receptor gamma
Type:Nuclear Receptor
Mol. Mass.:57613.46
Organism:Homo sapiens (Human)
Description:P37231
Residue:505
BDBM28681
NameBDBM28681
Synonyms:5-[(4-{2-[methyl(pyridin-2-yl)amino]ethoxy}phenyl)methyl]-1,3-thiazolidine-2,4-dione BRL 49653 CHEMBL121 [3H]rosiglitazone rosiglitazone
Typeradiolabeled ligand
Emp. Form.C18H19N3O3S
Mol. Mass.357.427
SMILESCN(CCOc1ccc(Cc2sc(=O)[nH]c2O)cc1)c1ccccn1