Reaction Details
TargetHistone deacetylase 2b
LigandBDBM19130
Substrate/Competitorn/a
Meas. Tech.ChEMBL_87387 (CHEMBL881938)
IC50 7.2±n/a nM
Citation Massa, SMai, ASbardella, GEsposito, MRagno, RLoidl, PBrosch, G 3-(4-aroyl-1H-pyrrol-2-yl)-N-hydroxy-2-propenamides, a new class of synthetic histone deacetylase inhibitors. J Med Chem44:2069-72 (2001) Histone deacetylase 2b
Name:Histone deacetylase 2b
Synonyms:Histone deacetylase HD2
Type:PROTEIN
Mol. Mass.:30785.07
Organism:Zea mays
Description:ChEMBL_87549
Residue:286
BDBM19130
NameBDBM19130
TypeSmall organic molecule
Emp. Form.C17H22N2O3
Mol. Mass.302.3682
SMILESCC(C=CC(=O)NO)C=C(C)C(=O)c1ccc(cc1)N(C)C