Reaction Details
TargetCollagenase ColA
LigandBDBM50100767
Substrate/Competitorn/a
Meas. Tech.ChEMBL_49485 (CHEMBL659907)
Ki 70±n/a nM
Citation Clare, BWScozzafava, ASupuran, CT Protease inhibitors: synthesis of a series of bacterial collagenase inhibitors of the sulfonyl amino acyl hydroxamate type. J Med Chem44:2253-8 (2001) Collagenase ColA
Name:Collagenase ColA
Type:PROTEIN
Mol. Mass.:125901.02
Organism:Clostridium perfringens
Description:ChEMBL_49485
Residue:1104
BDBM50100767
NameBDBM50100767
Synonyms:CHEMBL73183 | N-Hydroxy-2-[(2-nitro-benzyl)-trifluoromethanesulfonyl-amino]-propionamide
TypeSmall organic molecule
Emp. Form.C11H12F3N3O6S
Mol. Mass.371.29
SMILESCC(N(Cc1ccccc1[N+]([O-])=O)S(=O)(=O)C(F)(F)F)C(=O)NO