Reaction Details
TargetCollagenase ColA
LigandBDBM50100783
Substrate/Competitorn/a
Meas. Tech.ChEMBL_49485 (CHEMBL659907)
Ki 8±n/a nM
Citation Clare, BWScozzafava, ASupuran, CT Protease inhibitors: synthesis of a series of bacterial collagenase inhibitors of the sulfonyl amino acyl hydroxamate type. J Med Chem44:2253-8 (2001) Collagenase ColA
Name:Collagenase ColA
Type:PROTEIN
Mol. Mass.:125901.02
Organism:Clostridium perfringens
Description:ChEMBL_49485
Residue:1104
BDBM50100783
NameBDBM50100783
Synonyms:CHEMBL74172 | N-Hydroxy-2-[(naphthalene-2-sulfonyl)-(2-nitro-benzyl)-amino]-propionamide
TypeSmall organic molecule
Emp. Form.C20H19N3O6S
Mol. Mass.429.446
SMILESCC(N(Cc1ccccc1[N+]([O-])=O)S(=O)(=O)c1ccc2ccccc2c1)C(=O)NO