Reaction Details
TargetCollagenase ColA
LigandBDBM50100795
Substrate/Competitorn/a
Meas. Tech.ChEMBL_49485 (CHEMBL659907)
Ki 8±n/a nM
Citation Clare, BWScozzafava, ASupuran, CT Protease inhibitors: synthesis of a series of bacterial collagenase inhibitors of the sulfonyl amino acyl hydroxamate type. J Med Chem44:2253-8 (2001) Collagenase ColA
Name:Collagenase ColA
Type:PROTEIN
Mol. Mass.:125901.02
Organism:Clostridium perfringens
Description:ChEMBL_49485
Residue:1104
BDBM50100795
NameBDBM50100795
Synonyms:3-[(1-Hydroxycarbamoyl-ethyl)-(2-nitro-benzyl)-sulfamoyl]-benzoic acid | CHEMBL422950
TypeSmall organic molecule
Emp. Form.C17H17N3O8S
Mol. Mass.423.397
SMILESCC(N(Cc1ccccc1[N+]([O-])=O)S(=O)(=O)c1cccc(c1)C(O)=O)C(=O)NO