Reaction Details
TargetCollagenase ColA
LigandBDBM50100797
Substrate/Competitorn/a
Meas. Tech.ChEMBL_49485 (CHEMBL659907)
Ki 12±n/a nM
Citation Clare, BWScozzafava, ASupuran, CT Protease inhibitors: synthesis of a series of bacterial collagenase inhibitors of the sulfonyl amino acyl hydroxamate type. J Med Chem44:2253-8 (2001) Collagenase ColA
Name:Collagenase ColA
Type:PROTEIN
Mol. Mass.:125901.02
Organism:Clostridium perfringens
Description:ChEMBL_49485
Residue:1104
BDBM50100797
NameBDBM50100797
Synonyms:CHEMBL74054 | N-Hydroxy-2-[(2-nitro-benzyl)-(2-nitro-phenylsulfanyl)-amino]-propionamide
TypeSmall organic molecule
Emp. Form.C16H16N4O6S
Mol. Mass.392.386
SMILESCC(N(Cc1ccccc1[N+]([O-])=O)Sc1ccccc1[N+]([O-])=O)C(=O)NO