Reaction Details
TargetCollagenase ColA
LigandBDBM50100796
Substrate/Competitorn/a
Meas. Tech.ChEMBL_49485 (CHEMBL659907)
Ki 8±n/a nM
Citation Clare, BWScozzafava, ASupuran, CT Protease inhibitors: synthesis of a series of bacterial collagenase inhibitors of the sulfonyl amino acyl hydroxamate type. J Med Chem44:2253-8 (2001) Collagenase ColA
Name:Collagenase ColA
Type:PROTEIN
Mol. Mass.:125901.02
Organism:Clostridium perfringens
Description:ChEMBL_49485
Residue:1104
BDBM50100796
NameBDBM50100796
Synonyms:2-[({[(4-fluorophenyl)sulfonyl]amino}carbonyl)(2-nitrobenzyl)amino]-N-hydroxypropanamide | CHEMBL72064
TypeSmall organic molecule
Emp. Form.C17H17FN4O7S
Mol. Mass.440.403
SMILESCC(N(Cc1ccccc1[N+]([O-])=O)C(=O)NS(=O)(=O)c1ccc(F)cc1)C(=O)NO