Reaction Details
TargetCollagenase ColA
LigandBDBM50100802
Substrate/Competitorn/a
Meas. Tech.ChEMBL_49485 (CHEMBL659907)
Ki 10±n/a nM
Citation Clare, BWScozzafava, ASupuran, CT Protease inhibitors: synthesis of a series of bacterial collagenase inhibitors of the sulfonyl amino acyl hydroxamate type. J Med Chem44:2253-8 (2001) Collagenase ColA
Name:Collagenase ColA
Type:PROTEIN
Mol. Mass.:125901.02
Organism:Clostridium perfringens
Description:ChEMBL_49485
Residue:1104
BDBM50100802
NameBDBM50100802
Synonyms:CHEMBL423310 | N-Hydroxy-2-[(2-nitro-benzyl)-(thiophene-2-sulfonyl)-amino]-propionamide
TypeSmall organic molecule
Emp. Form.C14H15N3O6S2
Mol. Mass.385.415
SMILESCC(N(Cc1ccccc1[N+]([O-])=O)S(=O)(=O)c1cccs1)C(=O)NO