Reaction Details
TargetCollagenase ColA
LigandBDBM50100809
Substrate/Competitorn/a
Meas. Tech.ChEMBL_49485 (CHEMBL659907)
Ki 19±n/a nM
Citation Clare, BWScozzafava, ASupuran, CT Protease inhibitors: synthesis of a series of bacterial collagenase inhibitors of the sulfonyl amino acyl hydroxamate type. J Med Chem44:2253-8 (2001) Collagenase ColA
Name:Collagenase ColA
Type:PROTEIN
Mol. Mass.:125901.02
Organism:Clostridium perfringens
Description:ChEMBL_49485
Residue:1104
BDBM50100809
NameBDBM50100809
Synonyms:2-(N-(2-nitrobenzyl)-4-methoxyphenylsulfonamido)-N-hydroxypropanamide N-Hydroxy-2-[(4-methoxy-benzenesulfonyl)-(2-nitro-benzyl)-amino]-propionamide
TypeSmall organic molecule
Emp. Form.C17H19N3O7S
Mol. Mass.409.414
SMILESCOc1ccc(cc1)S(=O)(=O)N(Cc1ccccc1[N+]([O-])=O)C(C)C(=O)NO