Reaction Details
TargetCollagenase ColA
LigandBDBM50100842
Substrate/Competitorn/a
Meas. Tech.ChEMBL_49485 (CHEMBL659907)
Ki 8±n/a nM
Citation Clare, BWScozzafava, ASupuran, CT Protease inhibitors: synthesis of a series of bacterial collagenase inhibitors of the sulfonyl amino acyl hydroxamate type. J Med Chem44:2253-8 (2001) Collagenase ColA
Name:Collagenase ColA
Type:PROTEIN
Mol. Mass.:125901.02
Organism:Clostridium perfringens
Description:ChEMBL_49485
Residue:1104
BDBM50100842
NameBDBM50100842
Synonyms:2-[(Heptadecafluorooctane-1-sulfonyl)-(2-nitro-benzyl)-amino]-N-hydroxy-propionamide | CHEMBL303388
TypeSmall organic molecule
Emp. Form.C18H12F17N3O6S
Mol. Mass.721.342
SMILESCC(N(Cc1ccccc1[N+]([O-])=O)S(=O)(=O)C(F)(F)C(F)(F)C(F)(F)C(F)(F)C(F)(F)C(F)(F)C(F)(F)C(F)(F)F)C(=O)NO