Reaction Details
TargetCollagenase ColA
LigandBDBM50100849
Substrate/Competitorn/a
Meas. Tech.ChEMBL_49485 (CHEMBL659907)
Ki 13±n/a nM
Citation Clare, BWScozzafava, ASupuran, CT Protease inhibitors: synthesis of a series of bacterial collagenase inhibitors of the sulfonyl amino acyl hydroxamate type. J Med Chem44:2253-8 (2001) Collagenase ColA
Name:Collagenase ColA
Type:PROTEIN
Mol. Mass.:125901.02
Organism:Clostridium perfringens
Description:ChEMBL_49485
Residue:1104
BDBM50100849
NameBDBM50100849
Synonyms:CHEMBL306388 | N-Hydroxy-2-[(4-nitro-benzenesulfonyl)-(2-nitro-benzyl)-amino]-propionamide
TypeSmall organic molecule
Emp. Form.C16H16N4O8S
Mol. Mass.424.385
SMILESCC(N(Cc1ccccc1[N+]([O-])=O)S(=O)(=O)c1ccc(cc1)[N+]([O-])=O)C(=O)NO