Reaction Details
TargetCollagenase ColA
LigandBDBM50100850
Substrate/Competitorn/a
Meas. Tech.ChEMBL_49485 (CHEMBL659907)
Ki 14±n/a nM
Citation Clare, BWScozzafava, ASupuran, CT Protease inhibitors: synthesis of a series of bacterial collagenase inhibitors of the sulfonyl amino acyl hydroxamate type. J Med Chem44:2253-8 (2001) Collagenase ColA
Name:Collagenase ColA
Type:PROTEIN
Mol. Mass.:125901.02
Organism:Clostridium perfringens
Description:ChEMBL_49485
Residue:1104
BDBM50100850
NameBDBM50100850
Synonyms:2-[3-(3,4-Dichloro-phenyl)-1-(2-nitro-benzyl)-ureido]-N-hydroxy-propionamide | CHEMBL73650
TypeSmall organic molecule
Emp. Form.C17H16Cl2N4O5
Mol. Mass.427.239
SMILESCC(N(Cc1ccccc1[N+]([O-])=O)C(=O)Nc1ccc(Cl)c(Cl)c1)C(=O)NO