Reaction Details
Target3-dehydroquinate synthase
LigandBDBM50100862
Substrate/Competitorn/a
Meas. Tech.ChEMBL_350 (CHEMBL615323)
Ki 5000±n/a nM
Citation Chandran, SSFrost, JW Aromatic inhibitors of dehydroquinate synthase: synthesis, evaluation and implications for gallic acid biosynthesis. Bioorg Med Chem Lett11:1493-6 (2001) 3-dehydroquinate synthase
Name:3-dehydroquinate synthase
Type:Enzyme
Mol. Mass.:38878.02
Organism:Escherichia coli (strain K12)
Description:P07639
Residue:362
BDBM50100862
NameBDBM50100862
Synonyms:3,4-Dihydroxy-5-(2-phosphono-ethyl)-benzoic acid | CHEMBL285952
TypeSmall organic molecule
Emp. Form.C9H11O7P
Mol. Mass.262.1532
SMILESOC(=O)c1cc(O)c(O)c(CCP(O)(O)=O)c1