Reaction Details
TargetGABA A receptor alpha-4/beta-3/gamma-2
LigandBDBM24183
Substrate/Competitorn/a
Meas. Tech.ChEMBL_70537 (CHEMBL681094)
EC50 50000±n/a nM
Citation Ebert, BMortensen, MThompson, SAKehler, JWafford, KAKrogsgaard-Larsen, P Bioisosteric determinants for subtype selectivity of ligands for heteromeric GABA(A) receptors. Bioorg Med Chem Lett11:1573-7 (2001) GABA A receptor alpha-4/beta-3/gamma-2
Name:GABA A receptor alpha-4/beta-3/gamma-2
Type:n/a
Mol. Mass.:n/a
Description:ASSAY_ID of ChEMBL is 2148176
Components:This complex has 3 components.
Component 1
Name:Gamma-aminobutyric acid receptor subunit gamma-2
Synonyms:GABA(A) receptor subunit gamma-2 GBRG2_HUMAN
Type:PROTEIN
Mol. Mass.:54172.74
Organism:Homo sapiens (Human)
Description:EBI_217
Residue:467
Component 2
Name:Gamma-aminobutyric acid receptor subunit beta-3
Synonyms:GABA A receptor alpha-4/beta-3/gamma-2 GABA-A receptor GBRB3_HUMAN | agonist GABA site
Type:PROTEIN
Mol. Mass.:54130.51
Organism:Homo sapiens (Human)
Description:ChEMBL_448071
Residue:473
Component 3
Name:Gamma-aminobutyric acid receptor subunit alpha-4
Synonyms:GABA A Alpha4Beta2Gamma2 GABA A Alpha4Gamma2 GABA receptor alpha-4 subunit GABRA4 Gamma-aminobutyric acid receptor subunit alpha-4
Type:Enzyme Catalytic Domain
Mol. Mass.:61648.70
Organism:Homo sapiens (Human)
Description:GABA A Alpha4Beta2Gamma2 0 HUMAN::P48169
Residue:554
BDBM24183
NameBDBM24183
Synonyms:4-amino-n-[2,3-3H]butyric acid Aminalon GABA [3H]GABA | cid_119
TypeRadiolabeled ligand
Emp. Form.C4H9NO2
Mol. Mass.103.1198
SMILESNCCCC(O)=O