Reaction Details
TargetTryptase beta-2/delta/gamma
LigandBDBM50101019
Substrate/Competitorn/a
Meas. Tech.ChEMBL_210696 (CHEMBL817294)
Ki 0.910000±n/a nM
Citation Dener, JMRice, KDNewcomb, WSWang, VRYoung, WBGangloff, ARKuo, EYCregar, LPutnam, DWong, M Dibasic inhibitors of human mast cell tryptase. Part 3: identification of a series of potent and selective inhibitors containing the benzamidine functionality. Bioorg Med Chem Lett11:1629-33 (2001) Tryptase beta-2/delta/gamma
Name:Tryptase beta-2/delta/gamma
Synonyms:Tryptase
Type:n/a
Mol. Mass.:n/a
Description:ASSAY_ID of ChEMBL is 1510505
Components:This complex has 3 components.
Component 1
Name:Tryptase gamma
Type:PROTEIN
Mol. Mass.:33817.52
Organism:Homo sapiens (Human)
Description:ChEMBL_210833
Residue:321
Component 2
Name:Tryptase beta-2
Synonyms:TPS2 TRYB2_HUMAN Tryptase II Tryptase-2
Type:PROTEIN
Mol. Mass.:30518.79
Organism:Homo sapiens (Human)
Description:ChEMBL_210702
Residue:275
Component 3
Name:Tryptase delta
Synonyms:Delta-tryptase Mast cell mMCP-7-like TRYD_HUMAN Tryptase-3
Type:PROTEIN
Mol. Mass.:26578.73
Organism:Homo sapiens (Human)
Description:ChEMBL_104777
Residue:242
BDBM50101019
NameBDBM50101019
Synonyms:1-{4-[4-amino(imino)methylbenzylcarbamoyl]hexahydro-1-pyrazinylcarbonyloxy}-5-[4-(2-hexahydro-4-pyridinylethylcarbamoyl)hexahydro-1-pyrazinylcarbonyloxy]cyclooctane | CHEMBL40491
TypeSmall organic molecule
Emp. Form.C35H55N9O6
Mol. Mass.697.8679
SMILESNC(=N)c1ccc(CNC(=O)N2CCN(CC2)C(=O)O[C@@H]2CCC[C@@H](CCC2)OC(=O)N2CCN(CC2)C(=O)NCCC2CCNCC2)cc1