Reaction Details
TargetThymidine kinase
LigandBDBM50101053
Substrate/Competitorn/a
Meas. Tech.ChEBML_210614
IC50 0.130000±n/a nM
Citation Martin, JALambert, RWMerrett, JHParkes, KEThomas, GJBaker, SJBushnell, DJCansfield, JEDunsdon, SJFreeman, ACHopkins, RAJohns, IRKeech, ESimmonite, HWalmsley, AWong Kai-In, PHolland, M Nucleoside analogues as highly potent and selective inhibitors of herpes simplex virus thymidine kinase. Bioorg Med Chem Lett11:1655-8 (2001) Thymidine kinase
Name:Thymidine kinase
Synonyms:n/a
Type:PROTEIN
Mol. Mass.:40396.73
Organism:Human herpesvirus 2
Description:ChEMBL_474155
Residue:376
BDBM50101053
NameBDBM50101053
TypeSmall organic molecule
Emp. Form.C25H25N3O6
Mol. Mass.463.4825
SMILESCCc1cn([C@H]2C[C@H](O)[C@@H](CNC(=O)C3c4ccccc4Oc4ccccc34)O2)c(=O)[nH]c1=O