Reaction Details
TargetThymidine kinase
LigandBDBM50101072
Substrate/Competitorn/a
Meas. Tech.ChEBML_210611
IC50 1±n/a nM
Citation Martin, JALambert, RWMerrett, JHParkes, KEThomas, GJBaker, SJBushnell, DJCansfield, JEDunsdon, SJFreeman, ACHopkins, RAJohns, IRKeech, ESimmonite, HWalmsley, AWong Kai-In, PHolland, M Nucleoside analogues as highly potent and selective inhibitors of herpes simplex virus thymidine kinase. Bioorg Med Chem Lett11:1655-8 (2001) Thymidine kinase
Name:Thymidine kinase
Type:PROTEIN
Mol. Mass.:40883.42
Organism:Human herpesvirus 1 (strain SC16) (HHV-1) (Human herpes simplex virus1)
Description:ChEMBL_213
Residue:376
BDBM50101072
NameBDBM50101072
Synonyms:2-(2,6-Dichloro-phenyl)-N-[(2R,3S,5R)-5-(5-ethyl-2,4-dioxo-3,4-dihydro-2H-pyrimidin-1-yl)-3-hydroxy-tetrahydro-furan-2-ylmethyl]-acetamide | CHEMBL47094
TypeSmall organic molecule
Emp. Form.C19H21Cl2N3O5
Mol. Mass.442.293
SMILESCCc1cn([C@H]2C[C@H](O)[C@@H](CNC(=O)Cc3c(Cl)cccc3Cl)O2)c(=O)[nH]c1=O