Reaction Details
TargetEndothelin-1 receptor
LigandBDBM50101248
Substrate/Competitorn/a
Meas. Tech.ChEBML_65627
IC50 3300±n/a nM
Citation Kukkola, PJBilci, NAIkler, TSavage, PShetty, SSDelGrande, DJeng, AY Isoindolines: a new series of potent and selective endothelin-A receptor antagonists. Bioorg Med Chem Lett11:1737-40 (2001) Endothelin-1 receptor
Name:Endothelin-1 receptor
Type:Enzyme Catalytic Domain
Mol. Mass.:48736.88
Organism:Homo sapiens (Human)
Description:P25101
Residue:427
BDBM50101248
NameBDBM50101248
Synonyms:CHEMBL297353 | [(1R,3R)-1-Benzo[1,3]dioxol-5-yl-5-methoxy-3-(4-methoxy-phenyl)-1,3-dihydro-isoindol-2-yl]-acetic acid
TypeSmall organic molecule
Emp. Form.C25H23NO6
Mol. Mass.433.4532
SMILESCOc1ccc(cc1)[C@H]1N(CC(O)=O)[C@@H](c2ccc(OC)cc12)c1ccc2OCOc2c1