Reaction Details
TargetEndothelin-1 receptor
LigandBDBM50101257
Substrate/Competitorn/a
Meas. Tech.ChEMBL_65656 (CHEMBL679831)
Ki 0.430000±n/a nM
Citation Kukkola, PJBilci, NAIkler, TSavage, PShetty, SSDelGrande, DJeng, AY Isoindolines: a new series of potent and selective endothelin-A receptor antagonists. Bioorg Med Chem Lett11:1737-40 (2001) Endothelin-1 receptor
Name:Endothelin-1 receptor
Type:Enzyme Catalytic Domain
Mol. Mass.:48736.88
Organism:Homo sapiens (Human)
Description:P25101
Residue:427
BDBM50101257
NameBDBM50101257
Synonyms:(1R,2S,3R)-1-Benzo[1,3]dioxol-5-yl-3-(2-carboxymethoxy-4-methoxy-phenyl)-5-propoxy-indan-2-carboxylic acid | CHEMBL48196
TypeSmall organic molecule
Emp. Form.C29H28O9
Mol. Mass.520.5272
SMILESCCCOc1ccc2[C@H]([C@@H]([C@H](c2c1)c1ccc(OC)cc1OCC(O)=O)C(O)=O)c1ccc2OCOc2c1