Reaction Details
TargetEndothelin-1 receptor
LigandBDBM50101268
Substrate/Competitorn/a
Meas. Tech.ChEBML_65627
IC50 4.1±n/a nM
Citation Kukkola, PJBilci, NAIkler, TSavage, PShetty, SSDelGrande, DJeng, AY Isoindolines: a new series of potent and selective endothelin-A receptor antagonists. Bioorg Med Chem Lett11:1737-40 (2001) Endothelin-1 receptor
Name:Endothelin-1 receptor
Type:Enzyme Catalytic Domain
Mol. Mass.:48736.88
Organism:Homo sapiens (Human)
Description:P25101
Residue:427
BDBM50101268
NameBDBM50101268
Synonyms:CHEMBL50232 | [(1R,3R)-1-Benzo[1,3]dioxol-5-yl-3-(2-carboxymethoxy-4-methoxy-phenyl)-5-ethoxy-1,3-dihydro-isoindol-2-yl]-acetic acid
TypeSmall organic molecule
Emp. Form.C28H27NO9
Mol. Mass.521.5153
SMILESCCOc1ccc2[C@H](N(CC(O)=O)[C@H](c2c1)c1ccc(OC)cc1OCC(O)=O)c1ccc2OCOc2c1