Reaction Details
TargetCalpain small subunit 1
LigandBDBM50101323
Substrate/Competitorn/a
Meas. Tech.ChEBML_43685
Ki 28000±n/a nM
Citation Donkor, IOZheng, XHan, JLacy, CMiller, DD Significance of hydrogen bonding at the S(1)' subsite of calpain I. Bioorg Med Chem Lett11:1753-5 (2001) Calpain small subunit 1
Name:Calpain small subunit 1
Type:PROTEIN
Mol. Mass.:28062.13
Organism:Sus scrofa
Description:ChEMBL_43862
Residue:266
BDBM50101323
NameBDBM50101323
Synonyms:CHEMBL48567 | {(S)-1-[(S)-1-Benzyl-2-(benzyloxy-ethyl-carbamoyl)-2-oxo-ethylcarbamoyl]-3-methyl-butyl}-carbamic acid benzyl ester
TypeSmall organic molecule
Emp. Form.C33H39N3O6
Mol. Mass.573.6793
SMILESCCN(OCc1ccccc1)C(=O)C(=O)[C@H](Cc1ccccc1)NC(=O)[C@H](CC(C)C)NC(=O)OCc1ccccc1