Reaction Details
TargetCalpain small subunit 1
LigandBDBM50101324
Substrate/Competitorn/a
Meas. Tech.ChEBML_43685
Ki 750±n/a nM
Citation Donkor, IOZheng, XHan, JLacy, CMiller, DD Significance of hydrogen bonding at the S(1)' subsite of calpain I. Bioorg Med Chem Lett11:1753-5 (2001) Calpain small subunit 1
Name:Calpain small subunit 1
Type:PROTEIN
Mol. Mass.:28062.13
Organism:Sus scrofa
Description:ChEMBL_43862
Residue:266
BDBM50101324
NameBDBM50101324
Synonyms:CHEMBL176188 | {(S)-1-[(S)-1-Benzyl-2-(ethoxy-methyl-carbamoyl)-2-oxo-ethylcarbamoyl]-3-methyl-butyl}-carbamic acid benzyl ester
TypeSmall organic molecule
Emp. Form.C27H35N3O6
Mol. Mass.497.5833
SMILESCCON(C)C(=O)C(=O)[C@H](Cc1ccccc1)NC(=O)[C@H](CC(C)C)NC(=O)OCc1ccccc1