Reaction Details
TargetRetinoic acid receptor RXR-gamma
LigandBDBM50101444
Substrate/Competitorn/a
Meas. Tech.ChEMBL_164863 (CHEMBL772122)
Kd 1.8±n/a nM
Citation Vuligonda, VThacher, SMChandraratna, RA Enantioselective syntheses of potent retinoid X receptor ligands: differential biological activities of individual antipodes. J Med Chem44:2298-303 (2001) Retinoic acid receptor RXR-gamma
Name:Retinoic acid receptor RXR-gamma
Type:PROTEIN
Mol. Mass.:50878.26
Organism:Homo sapiens (Human)
Description:ChEMBL_197216
Residue:463
BDBM50101444
NameBDBM50101444
Synonyms:(E)-3-Methyl-5-[2-methyl-2-(5,5,8,8-tetramethyl-5,6,7,8-tetrahydro-naphthalen-2-yl)-cyclopropyl]-penta-2,4-dienoic acid CHEMBL69091
TypeSmall organic molecule
Emp. Form.C24H32O2
Mol. Mass.352.5097
SMILESC\C(\C=C\C1CC1(C)c1ccc2c(c1)C(C)(C)CCC2(C)C)=C/C(O)=O