Reaction Details
TargetRetinoic acid receptor RXR-beta
LigandBDBM50101446
Substrate/Competitorn/a
Meas. Tech.ChEMBL_164861 (CHEMBL772120)
Kd 210±n/a nM
Citation Vuligonda, VThacher, SMChandraratna, RA Enantioselective syntheses of potent retinoid X receptor ligands: differential biological activities of individual antipodes. J Med Chem44:2298-303 (2001) Retinoic acid receptor RXR-beta
Name:Retinoic acid receptor RXR-beta
Type:PROTEIN
Mol. Mass.:56932.89
Organism:Homo sapiens (Human)
Description:ChEMBL_39045
Residue:533
BDBM50101446
NameBDBM50101446
Synonyms:(2E,4E)-3-Methyl-5-[(1R,2R)-2-methyl-2-(5,5,8,8-tetramethyl-5,6,7,8-tetrahydro-naphthalen-2-yl)-cyclopropyl]-penta-2,4-dienoic acid CHEMBL308377
TypeSmall organic molecule
Emp. Form.C24H32O2
Mol. Mass.352.5097
SMILESC\C(\C=C\[C@H]1C[C@@]1(C)c1ccc2c(c1)C(C)(C)CCC2(C)C)=C/C(O)=O