Reaction Details
TargetStromelysin-1
LigandBDBM50101505
Substrate/Competitorn/a
Meas. Tech.ChEMBL_104874 (CHEMBL708551)
Ki 0.96±n/a nM
Citation Terp, GEJohansen, BNChristensen, ITJørgensen, FS A new concept for multidimensional selection of ligand conformations (MultiSelect) and multidimensional scoring (MultiScore) of protein-ligand binding affinities. J Med Chem44:2333-43 (2001) Stromelysin-1
Name:Stromelysin-1
Type:Enzyme
Mol. Mass.:53973.13
Organism:Homo sapiens (Human)
Description: P08254
Residue:477
BDBM50101505
NameBDBM50101505
Synonyms:3-(3-{2-[5-(4-Chloro-phenyl)-2-hydroxycarbamoylmethyl-pentanoylamino]-3-cyclohexyl-propionylamino}-propionylamino)-propionic acid methyl ester | CHEMBL308533
TypeSmall organic molecule
Emp. Form.C29H43ClN4O7
Mol. Mass.595.127
SMILESCOC(=O)CCNC(=O)CCNC(=O)[C@H](CC1CCCCC1)NC(=O)[C@H](CCCc1ccc(Cl)cc1)CC(=O)NO