Reaction Details
TargetStromelysin-1
LigandBDBM50101520
Substrate/Competitorn/a
Meas. Tech.ChEMBL_104874 (CHEMBL708551)
Ki 2.61±n/a nM
Citation Terp, GEJohansen, BNChristensen, ITJørgensen, FS A new concept for multidimensional selection of ligand conformations (MultiSelect) and multidimensional scoring (MultiScore) of protein-ligand binding affinities. J Med Chem44:2333-43 (2001) Stromelysin-1
Name:Stromelysin-1
Type:Enzyme
Mol. Mass.:53973.13
Organism:Homo sapiens (Human)
Description: P08254
Residue:477
BDBM50101520
NameBDBM50101520
Synonyms:CHEMBL77663 | N*1*-{2-Cyclohexyl-1-[2-(4-morpholin-4-yl-butylcarbamoyl)-ethylcarbamoyl]-ethyl}-N*4*-hydroxy-2-(3-p-tolyl-propyl)-succinamide
TypeSmall organic molecule
Emp. Form.C34H55N5O6
Mol. Mass.629.8304
SMILESCc1ccc(CCC[C@H](CC(=O)NO)C(=O)N[C@@H](CC2CCCCC2)C(=O)NCCC(=O)NCCCCN2CCOCC2)cc1