Reaction Details
Target72 kDa type IV collagenase
LigandBDBM50101504
Substrate/Competitorn/a
Meas. Tech.ChEMBL_104539 (CHEMBL718926)
Ki 0.02±n/a nM
Citation Terp, GEJohansen, BNChristensen, ITJørgensen, FS A new concept for multidimensional selection of ligand conformations (MultiSelect) and multidimensional scoring (MultiScore) of protein-ligand binding affinities. J Med Chem44:2333-43 (2001) 72 kDa type IV collagenase
Name:72 kDa type IV collagenase
Type:Enzyme
Mol. Mass.:73870.36
Organism:Homo sapiens (Human)
Description: P08253
Residue:660
BDBM50101504
NameBDBM50101504
Synonyms:CHEMBL77057 | N*1*-{2-Cyclohexyl-1-[2-(4-dimethylamino-butylcarbamoyl)-ethylcarbamoyl]-ethyl}-N*4*-hydroxy-2-(3-p-tolyl-propyl)-succinamide
TypeSmall organic molecule
Emp. Form.C32H53N5O5
Mol. Mass.587.7937
SMILESCN(C)CCCCNC(=O)CCNC(=O)[C@H](CC1CCCCC1)NC(=O)[C@H](CCCc1ccc(C)cc1)CC(=O)NO