Reaction Details
TargetStromelysin-1
LigandBDBM50101503
Substrate/Competitorn/a
Meas. Tech.ChEMBL_104874 (CHEMBL708551)
Ki 2.39±n/a nM
Citation Terp, GEJohansen, BNChristensen, ITJørgensen, FS A new concept for multidimensional selection of ligand conformations (MultiSelect) and multidimensional scoring (MultiScore) of protein-ligand binding affinities. J Med Chem44:2333-43 (2001) Stromelysin-1
Name:Stromelysin-1
Type:Enzyme
Mol. Mass.:53973.13
Organism:Homo sapiens (Human)
Description: P08254
Residue:477
BDBM50101503
NameBDBM50101503
Synonyms:2-[3-(4-Chloro-phenyl)-propyl]-N*1*-{2-cyclohexyl-1-[2-(4-morpholin-4-yl-butylcarbamoyl)-ethylcarbamoyl]-ethyl}-N*4*-hydroxy-succinamide | CHEMBL74308
TypeSmall organic molecule
Emp. Form.C33H52ClN5O6
Mol. Mass.650.249
SMILESONC(=O)C[C@@H](CCCc1ccc(Cl)cc1)C(=O)N[C@@H](CC1CCCCC1)C(=O)NCCC(=O)NCCCCN1CCOCC1