Reaction Details
TargetCarnitine O-palmitoyltransferase 1, liver isoform
LigandBDBM50101591
Substrate/Competitorn/a
Meas. Tech.ChEMBL_46317 (CHEMBL663461)
IC50 800±n/a nM
Citation Giannessi, FChiodi, PMarzi, MMinetti, PPessotto, PDe Angelis, FTassoni, EConti, RGiorgi, FMabilia, MDell'Uomo, NMuck, STinti, MOCarminati, PArduini, A Reversible carnitine palmitoyltransferase inhibitors with broad chemical diversity as potential antidiabetic agents. J Med Chem44:2383-6 (2001) Carnitine O-palmitoyltransferase 1, liver isoform
Name:Carnitine O-palmitoyltransferase 1, liver isoform
Type:PROTEIN
Mol. Mass.:88147.11
Organism:Rattus norvegicus
Description:ChEMBL_887445
Residue:773
BDBM50101591
NameBDBM50101591
Synonyms:CHEMBL308869 [3-Carboxy-2-(undecylaminosulphonyl-amino)-propyl]-trimethyl-ammonium
TypeSmall organic molecule
Emp. Form.C18H39N3O4S
Mol. Mass.393.585
SMILESCCCCCCCCCCCNS(=O)(=O)N[C@H](CC([O-])=O)C[N+](C)(C)C