Reaction Details
TargetCarnitine O-palmitoyltransferase 1, muscle isoform
LigandBDBM50101593
Substrate/Competitorn/a
Meas. Tech.ChEMBL_46323 (CHEMBL660891)
IC50 211000±n/a nM
Citation Giannessi, FChiodi, PMarzi, MMinetti, PPessotto, PDe Angelis, FTassoni, EConti, RGiorgi, FMabilia, MDell'Uomo, NMuck, STinti, MOCarminati, PArduini, A Reversible carnitine palmitoyltransferase inhibitors with broad chemical diversity as potential antidiabetic agents. J Med Chem44:2383-6 (2001) Carnitine O-palmitoyltransferase 1, muscle isoform
Name:Carnitine O-palmitoyltransferase 1, muscle isoform
Type:PROTEIN
Mol. Mass.:88241.28
Organism:Rattus norvegicus
Description:ChEMBL_887447
Residue:772
BDBM50101593
NameBDBM50101593
Synonyms:(3-Carboxy-2-octyloxycarbonylamino-propyl)-trimethyl-ammonium | CHEMBL78979
TypeSmall organic molecule
Emp. Form.C16H32N2O4
Mol. Mass.316.4363
SMILESCCCCCCCCOC(=O)NC(CC([O-])=O)C[N+](C)(C)C